{"text_format":"1","workbook":"xlsx","n_sheets":16,"sheets":["Votanti","Scrutinio","SEZ.1","SEZ.2","SEZ.3","SEZ.4","SEZ.5","SEZ.6","Totali","1","2","3","4","5","6","Candidati"],"not_rendered":{"charts":0,"images":2,"macros":1,"external_links":0,"defined_names":0,"comments":0,"pivot_tables":0},"unopened":[],"bounds":{"document_bytes":16777216,"sheet_cells":100000,"rows_first":2000,"rows_last":500,"rows_between":2000,"halvings":0,"cell_chars":16384,"cell_head_chars":4096},"cells_cut":0,"cells_raw":0,"read":"whole","date_system":"1900"}

{"sheet":"Votanti","index":0,"n_rows":14,"n_cols":14,"rows_kept":14,"cut":false,"hidden":false,"merged":[[3,2,4,4],[4,9,4,11],[3,9,3,11],[1,1,1,13]]}
[]
[null,"ELEZIONI POLITICHE del 4 MARZO 2018 - SENATO della REPUBBLICA"]
[]
[null,null,"TOTALE ELETTORI SENATO",null,null,null,null,null,null,"VOTANTI"]
[null,null,null,null,null,null,null,null,null,"Chiusura Seggi"]
[null,"SEZ","M","F","TOT","SEZ",null,null,"SEZ","M","F","TOT","SEZ"]
[null,1,369,412,{"$f":"SUM(C7:D7)","v":781},1,null,null,1,284,283,{"$f":"SUM(J7:K7)","v":567},1,{"$f":"IFERROR(SUM(L7/E7%/100),0%)","v":0.72599231754161342}]
[null,2,314,375,689,2,null,null,2,238,270,508,2,{"$f":"IFERROR(SUM(L8/E8%/100),0%)","v":0.73730043541364298}]
[null,3,337,387,724,3,null,null,3,248,243,491,3,0.67817679558011046]
[null,4,435,484,919,4,null,null,4,335,340,675,4,0.73449401523394997]
[null,5,366,396,762,5,null,null,5,282,270,552,5,0.72440944881889768]
[null,6,348,418,766,6,null,null,6,259,276,535,6,0.69843342036553524]
[null,null,{"$f":"SUM(C7:C12)","v":2169},{"$f":"SUM(D7:D12)","v":2472},{"$f":"SUM(E7:E12)","v":4641},null,null,null,null,{"$f":"SUM(J7:J12)","v":1646},{"$f":"SUM(K7:K12)","v":1682},3328]
[null,null,{"$f":"IFERROR(SUM(C13/E13%/100),0%)","v":0.46735617323852624},{"$f":"IFERROR(SUM(D13/E13%/100),0%)","v":0.53264382676147382},{"$f":"SUM(C14:D14)","v":1},null,null,null,null,{"$f":"IFERROR(SUM(J13/C13%/100),0%)","v":0.75887505763024432},{"$f":"IFERROR(SUM(K13/D13%/100),0%)","v":0.68042071197411003},0.71708683473389356]

{"sheet":"Scrutinio","index":1,"n_rows":30,"n_cols":28,"rows_kept":30,"cut":false,"hidden":false,"merged":[[5,1,5,10],[8,2,8,4],[8,10,8,13],[30,13,30,16],[18,2,18,4],[18,5,18,7],[8,5,8,7],[3,20,3,24],[6,18,9,18],[6,19,9,19],[6,20,9,20],[6,21,9,21],[3,14,3,19],[6,17,9,17],[6,22,9,22],[6,23,9,23],[6,24,9,24],[6,14,9,14],[6,15,9,15],[6,16,9,16],[4,14,4,24]]}
[]
[]
[]
[null,null,null,null,null,null,null,null,null,null,null,null,null,null,{"$f":"SUM(B16)","v":6},null,null,null,null,null,{"$f":"IF(O4=0,\"sezioni su 6\",IF(O4=1,\"sezione su 6\",\"sezioni su 6\"))","v":"sezioni su 6"}]
[null,null,null,null,null,null,null,null,null,null,null,null,null,null,"CANDIDATO"]
[null,null,null,null,null,null,null,null,null,null,null,null,null,null,1,2,3,4,5,6,7,8,9,10,11]
[null,null,null,null,null,null,null,null,null,null,null,null,null,null,"BIZZARRO","MARTIGNANO","ROMANO","BELLANOVA","DE CARLO","ADASHA","LECCISO","LEZZI","CARIDDI","D'ALEMA","SCAVO"]
[]
[null,null,"ELETTORI",null,null,"VOTANTI",null,null,null,null,"VOTI NON VALIDI",null,null,null,null,"Rocco Antonio"]
[null,"SEZ","M","F","TOT","M","F","TOT","% VOTANTI","SEZ","BIANCHE","NULLE","CONTESTATE O NON ATTRIBUITE","TOT.",null,"CONTE"]
[null,1,{"$f":"Votanti!C7","v":369},{"$f":"Votanti!D7","v":412},{"$f":"Votanti!E7","v":781},{"$f":"Votanti!J7","v":284},{"$f":"Votanti!K7","v":283},{"$f":"Votanti!L7","v":567},{"$f":"Votanti!N7","v":0.72599231754161342},1,{"$f":"SEZ.1!E11","v":17},{"$f":"SEZ.1!E12","v":13},{"$f":"SEZ.1!E13","v":0},{"$f":"SUM(K11:M11)","v":30},{"$f":"'1'!$D$5","v":7},{"$f":"'1'!$D$7","v":3},{"$f":"'1'!$D$9","v":1},{"$f":"'1'!$D$10","v":65},{"$f":"'1'!$D$16","v":5},{"$f":"'1'!$D$18","v":1},{"$f":"'1'!$D$20","v":1},{"$f":"'1'!$D$22","v":170},{"$f":"'1'!$D$23","v":273},{"$f":"'1'!$D$29","v":11},{"$f":"'1'!$D$31","v":0},null,null,{"$f":"IF(H11>\"0\",IF(H11=AA11,\"OK\",H11-AA11),\"\")","v":""}]
[null,2,{"$f":"Votanti!C8","v":314},{"$f":"Votanti!D8","v":375},{"$f":"Votanti!E8","v":689},{"$f":"Votanti!J8","v":238},{"$f":"Votanti!K8","v":270},{"$f":"Votanti!L8","v":508},{"$f":"Votanti!N8","v":0.73730043541364298},2,{"$f":"SEZ.2!E11","v":11},{"$f":"SEZ.2!E12","v":8},{"$f":"SEZ.2!E13","v":0},{"$f":"SUM(K12:M12)","v":19},{"$f":"'2'!$D$5","v":5},{"$f":"'2'!$D$7","v":2},{"$f":"'2'!$D$9","v":1},{"$f":"'2'!$D$10","v":105},{"$f":"'2'!$D$16","v":7},{"$f":"'2'!$D$18","v":1},{"$f":"'2'!$D$20","v":0},{"$f":"'2'!$D$22","v":144},{"$f":"'2'!$D$23","v":212},{"$f":"'2'!$D$29","v":11},{"$f":"'2'!$D$31","v":1},null,null,{"$f":"IF(H12>\"0\",IF(H12=AA12,\"OK\",H12-AA12),\"\")","v":""}]
[null,3,{"$f":"Votanti!C9","v":337},{"$f":"Votanti!D9","v":387},{"$f":"Votanti!E9","v":724},{"$f":"Votanti!J9","v":248},{"$f":"Votanti!K9","v":243},{"$f":"Votanti!L9","v":491},{"$f":"Votanti!N9","v":0.67817679558011046},3,{"$f":"SEZ.3!E11","v":11},{"$f":"SEZ.3!E12","v":6},{"$f":"SEZ.3!E13","v":0},17,{"$f":"'3'!$D$5","v":6},{"$f":"'3'!$D$7","v":2},{"$f":"'3'!$D$9","v":0},{"$f":"'3'!$D$10","v":60},{"$f":"'3'!$D$16","v":4},{"$f":"'3'!$D$18","v":2},{"$f":"'3'!$D$20","v":0},{"$f":"'3'!$D$22","v":144},{"$f":"'3'!$D$23","v":239},{"$f":"'3'!$D$29","v":17},{"$f":"'3'!$D$31","v":0},null,null,""]
[null,4,{"$f":"Votanti!C10","v":435},{"$f":"Votanti!D10","v":484},{"$f":"Votanti!E10","v":919},{"$f":"Votanti!J10","v":335},{"$f":"Votanti!K10","v":340},{"$f":"Votanti!L10","v":675},{"$f":"Votanti!N10","v":0.73449401523394997},4,{"$f":"SEZ.4!E11","v":17},{"$f":"SEZ.4!E12","v":9},{"$f":"SEZ.4!E13","v":0},26,{"$f":"'4'!$D$5","v":9},{"$f":"'4'!$D$7","v":4},{"$f":"'4'!$D$9","v":1},{"$f":"'4'!$D$10","v":93},{"$f":"'4'!$D$16","v":11},{"$f":"'4'!$D$18","v":1},{"$f":"'4'!$D$20","v":3},{"$f":"'4'!$D$22","v":221},{"$f":"'4'!$D$23","v":285},{"$f":"'4'!$D$29","v":21},{"$f":"'4'!$D$31","v":0},null,null,""]
[null,5,{"$f":"Votanti!C11","v":366},{"$f":"Votanti!D11","v":396},{"$f":"Votanti!E11","v":762},{"$f":"Votanti!J11","v":282},{"$f":"Votanti!K11","v":270},{"$f":"Votanti!L11","v":552},{"$f":"Votanti!N11","v":0.72440944881889768},5,{"$f":"SEZ.5!E11","v":15},{"$f":"SEZ.5!E12","v":19},{"$f":"SEZ.5!E13","v":0},34,{"$f":"'5'!$D$5","v":4},{"$f":"'5'!$D$7","v":3},{"$f":"'5'!$D$9","v":0},{"$f":"'5'!$D$10","v":79},{"$f":"'5'!$D$16","v":1},{"$f":"'5'!$D$18","v":3},{"$f":"'5'!$D$20","v":1},{"$f":"'5'!$D$22","v":157},{"$f":"'5'!$D$23","v":255},{"$f":"'5'!$D$29","v":14},{"$f":"'5'!$D$31","v":1},null,null,""]
[null,6,{"$f":"Votanti!C12","v":348},{"$f":"Votanti!D12","v":418},{"$f":"Votanti!E12","v":766},{"$f":"Votanti!J12","v":259},{"$f":"Votanti!K12","v":276},{"$f":"Votanti!L12","v":535},{"$f":"Votanti!N12","v":0.69843342036553524},6,{"$f":"SEZ.6!E11","v":8},{"$f":"SEZ.6!E12","v":29},{"$f":"SEZ.6!E13","v":0},37,{"$f":"'6'!$D$5","v":8},{"$f":"'6'!$D$7","v":5},{"$f":"'6'!$D$9","v":0},{"$f":"'6'!$D$10","v":72},{"$f":"'6'!$D$16","v":8},{"$f":"'6'!$D$18","v":1},{"$f":"'6'!$D$20","v":1},{"$f":"'6'!$D$22","v":184},{"$f":"'6'!$D$23","v":202},{"$f":"'6'!$D$29","v":17},{"$f":"'6'!$D$31","v":0},null,null,""]
[null,null,{"$f":"SUM(C11:C16)","v":2169},{"$f":"SUM(D11:D16)","v":2472},{"$f":"SUM(E11:E16)","v":4641},{"$f":"SUM(F11:F16)","v":1646},{"$f":"SUM(G11:G16)","v":1682},{"$f":"SUM(F17:G17)","v":3328},null,null,{"$f":"SUM(K11:K16)","v":79},{"$f":"SUM(L11:L16)","v":84},{"$f":"SUM(M11:M16)","v":0},{"$f":"SUM(K17:M17)","v":163},{"$f":"SUM(O11:O16)","v":39},19,3,474,36,9,6,1020,1466,91,2]
[null,null,{"$f":"Votanti!C14","v":0.46735617323852624},{"$f":"Votanti!D14","v":0.53264382676147382},{"$f":"Votanti!E14","v":1},{"$f":"Votanti!J14","v":0.75887505763024432},{"$f":"Votanti!K14","v":0.68042071197411003},{"$f":"Votanti!L14","v":0.71708683473389356},null,null,{"$f":"IFERROR(SUM(K17/$H$17%/100),0%)","v":2.3737980769230768E-2},2.5240384615384612E-2,0,{"$f":"IFERROR(SUM(N17/$H$17%/100),0%)","v":4.8978365384615384E-2},{"$f":"O17/H17","v":1.171875E-2},{"$f":"P17/H17","v":5.7091346153846151E-3},{"$f":"Q17/H17","v":9.0144230769230774E-4},{"$f":"R17/H17","v":0.14242788461538461},{"$f":"S17/H17","v":1.0817307692307692E-2},{"$f":"T17/H17","v":2.704326923076923E-3},{"$f":"U17/H17","v":1.8028846153846155E-3},{"$f":"V17/H17","v":0.30649038461538464},{"$f":"W17/H17","v":0.44050480769230771},{"$f":"X17/H17","v":2.734375E-2},{"$f":"Y17/H17","v":6.0096153846153849E-4}]
[null,null,"ELETTORI",null,null,"VOTANTI"]
[null,null,null,null,null,null,null,null,null,null,null,null,null,{"$f":"IF(Q20>0,RANK(Q20,$Q$20:$Q$30),\"\")","v":1},{"$f":"INDEX(Candidati!$C$4:$C$14,MATCH(LARGE(Candidati!$D$4:$D$14-ROW(Candidati!$D$4:$D$14)/100,ROW(N20)-ROW($K$19)),Candidati!$D$4:$D$14-ROW(Candidati!$D$4:$D$14)/100,0))","v":"CARIDDI"},null,{"$f":"VLOOKUP(O20,Candidati!$C$3:$D$14,2,0)","v":1466}]
{"$rows_left_out":11}
{"sheet":"SEZ.1","index":2,"n_rows":16,"n_cols":6,"rows_kept":16,"cut":false,"hidden":false,"merged":[[1,2,2,4],[12,2,12,3],[6,2,6,3],[7,2,7,3],[9,2,9,3],[4,2,4,3],[5,2,5,3],[10,2,10,3],[11,2,11,3]]}
[]
[null,null,"VOTANTI SENATO"]
[]
[]
[null,null,"Maschi",null,{"$f":"Votanti!J7","v":284}]
[null,null,"Femmine",null,{"$f":"Votanti!K7","v":283}]
[null,null,"TOTALE VOTANTI",null,{"$f":"SUM(E5:E6)","v":567},{"$f":"IF(E9=\"\",\"\",IF(E7=(E9+E14),\"OK!\",\"ERRORE\"))","v":""}]
[]
[null,null,"a","TOTALE voti validi"]
[]
[null,null,"SCHEDE BIANCHE",null,17]
[null,null,"SCHEDE NULLE",null,13]
[null,null,"SCHEDE contestate e provvisoriamente non attribuite"]
[null,null,"b","TOTALE Schede NON VALIDE",{"$f":"SUM(E11:E13)","v":30}]
[]
[null,null,null,{"$f":"IF(E16<\"\",\"TOTALE (a) + (b)\",\"\")","v":""},{"$f":"IF(E9=\"\",\"\",IF(E9+E14=E7,\"\",E9+E14))","v":""},{"$f":"IF(E9=\"\",\"\",IF(E9+E14=E7,\"\",E9+E14-E7))","v":""}]

{"sheet":"SEZ.2","index":3,"n_rows":16,"n_cols":6,"rows_kept":16,"cut":false,"hidden":false,"merged":[[1,2,2,4],[11,2,11,3],[12,2,12,3],[4,2,4,3],[5,2,5,3],[6,2,6,3],[10,2,10,3],[7,2,7,3],[9,2,9,3]]}
[]
[null,null,"VOTANTI SENATO"]
[]
[]
[null,null,"Maschi",null,{"$f":"Votanti!J8","v":238}]
[null,null,"Femmine",null,{"$f":"Votanti!K8","v":270}]
[null,null,"TOTALE VOTANTI",null,{"$f":"SUM(E5:E6)","v":508},{"$f":"IF(E12=\"\",\"\",IF(E7=(E9+E14),\"OK!\",\"ERRORE\"))","v":"ERRORE"}]
[]
[null,null,"a","TOTALE voti validi"]
[]
[null,null,"SCHEDE BIANCHE",null,11]
[null,null,"SCHEDE NULLE",null,8]
[null,null,"SCHEDE contestate e provvisoriamente non attribuite"]
[null,null,"b","TOTALE Schede NON VALIDE",{"$f":"SUM(E11:E13)","v":19}]
[]
[null,null,null,{"$f":"IF(E16<\"\",\"TOTALE (a) + (b)\",\"\")","v":""},{"$f":"IF(E9=\"\",\"\",IF(E9+E14=E7,\"\",E9+E14))","v":""},{"$f":"IF(E9=\"\",\"\",IF(E9+E14=E7,\"\",E9+E14-E7))","v":""}]

{"sheet":"SEZ.3","index":4,"n_rows":16,"n_cols":6,"rows_kept":16,"cut":false,"hidden":false,"merged":[[1,2,2,4],[11,2,11,3],[12,2,12,3],[4,2,4,3],[5,2,5,3],[6,2,6,3],[10,2,10,3],[7,2,7,3],[9,2,9,3]]}
[]
[null,null,"VOTANTI SENATO"]
[]
[]
[null,null,"Maschi",null,{"$f":"Votanti!J9","v":248}]
[null,null,"Femmine",null,{"$f":"Votanti!K9","v":243}]
[null,null,"TOTALE VOTANTI",null,{"$f":"SUM(E5:E6)","v":491},{"$f":"IF(E12=\"\",\"\",IF(E7=(E9+E14),\"OK!\",\"ERRORE\"))","v":"ERRORE"}]
[]
[null,null,"a","TOTALE voti validi"]
[]
[null,null,"SCHEDE BIANCHE",null,11]
[null,null,"SCHEDE NULLE",null,6]
[null,null,"SCHEDE contestate e provvisoriamente non attribuite"]
[null,null,"b","TOTALE Schede NON VALIDE",{"$f":"SUM(E11:E13)","v":17}]
[]
[null,null,null,{"$f":"IF(E16<\"\",\"TOTALE (a) + (b)\",\"\")","v":""},{"$f":"IF(E9=\"\",\"\",IF(E9+E14=E7,\"\",E9+E14))","v":""},{"$f":"IF(E9=\"\",\"\",IF(E9+E14=E7,\"\",E9+E14-E7))","v":""}]

{"sheet":"SEZ.4","index":5,"n_rows":16,"n_cols":6,"rows_kept":16,"cut":false,"hidden":false,"merged":[[1,2,2,4],[11,2,11,3],[12,2,12,3],[4,2,4,3],[5,2,5,3],[6,2,6,3],[10,2,10,3],[7,2,7,3],[9,2,9,3]]}
[]
[null,null,"VOTANTI SENATO"]
[]
[]
[null,null,"Maschi",null,{"$f":"Votanti!J10","v":335}]
[null,null,"Femmine",null,{"$f":"Votanti!K10","v":340}]
[null,null,"TOTALE VOTANTI",null,{"$f":"SUM(E5:E6)","v":675},{"$f":"IF(E12=\"\",\"\",IF(E7=(E9+E14),\"OK!\",\"ERRORE\"))","v":"ERRORE"}]
[]
[null,null,"a","TOTALE voti validi"]
[]
[null,null,"SCHEDE BIANCHE",null,17]
[null,null,"SCHEDE NULLE",null,9]
[null,null,"SCHEDE contestate e provvisoriamente non attribuite"]
[null,null,"b","TOTALE Schede NON VALIDE",{"$f":"SUM(E11:E13)","v":26}]
[]
[null,null,null,{"$f":"IF(E16<\"\",\"TOTALE (a) + (b)\",\"\")","v":""},{"$f":"IF(E9=\"\",\"\",IF(E9+E14=E7,\"\",E9+E14))","v":""},{"$f":"IF(E9=\"\",\"\",IF(E9+E14=E7,\"\",E9+E14-E7))","v":""}]

{"sheet":"SEZ.5","index":6,"n_rows":16,"n_cols":6,"rows_kept":16,"cut":false,"hidden":false,"merged":[[1,2,2,4],[11,2,11,3],[12,2,12,3],[4,2,4,3],[5,2,5,3],[6,2,6,3],[10,2,10,3],[7,2,7,3],[9,2,9,3]]}
[]
[null,null,"VOTANTI SENATO"]
[]
[]
[null,null,"Maschi",null,{"$f":"Votanti!J11","v":282}]
[null,null,"Femmine",null,{"$f":"Votanti!K11","v":270}]
[null,null,"TOTALE VOTANTI",null,{"$f":"SUM(E5:E6)","v":552},{"$f":"IF(E12=\"\",\"\",IF(E7=(E9+E14),\"OK!\",\"ERRORE\"))","v":"ERRORE"}]
[]
[null,null,"a","TOTALE voti validi"]
[]
[null,null,"SCHEDE BIANCHE",null,15]
[null,null,"SCHEDE NULLE",null,19]
[null,null,"SCHEDE contestate e provvisoriamente non attribuite"]
[null,null,"b","TOTALE Schede NON VALIDE",{"$f":"SUM(E11:E13)","v":34}]
[]
[null,null,null,{"$f":"IF(E16<\"\",\"TOTALE (a) + (b)\",\"\")","v":""},{"$f":"IF(E9=\"\",\"\",IF(E9+E14=E7,\"\",E9+E14))","v":""},{"$f":"IF(E9=\"\",\"\",IF(E9+E14=E7,\"\",E9+E14-E7))","v":""}]

{"sheet":"SEZ.6","index":7,"n_rows":16,"n_cols":6,"rows_kept":16,"cut":false,"hidden":false,"merged":[[1,2,2,4],[11,2,11,3],[12,2,12,3],[4,2,4,3],[5,2,5,3],[6,2,6,3],[10,2,10,3],[7,2,7,3],[9,2,9,3]]}
[]
[null,null,"VOTANTI SENATO"]
[]
[]
[null,null,"Maschi",null,{"$f":"Votanti!J12","v":259}]
[null,null,"Femmine",null,{"$f":"Votanti!K12","v":276}]
[null,null,"TOTALE VOTANTI",null,{"$f":"SUM(E5:E6)","v":535},{"$f":"IF(E12=\"\",\"\",IF(E7=(E9+E14),\"OK!\",\"ERRORE\"))","v":"ERRORE"}]
[]
[null,null,"a","TOTALE voti validi"]
[]
[null,null,"SCHEDE BIANCHE",null,8]
[null,null,"SCHEDE NULLE",null,29]
[null,null,"SCHEDE contestate e provvisoriamente non attribuite"]
[null,null,"b","TOTALE Schede NON VALIDE",{"$f":"SUM(E11:E13)","v":37}]
[]
[null,null,null,{"$f":"IF(E16<\"\",\"TOTALE (a) + (b)\",\"\")","v":""},{"$f":"IF(E9=\"\",\"\",IF(E9+E14=E7,\"\",E9+E14))","v":""},{"$f":"IF(E9=\"\",\"\",IF(E9+E14=E7,\"\",E9+E14-E7))","v":""}]

{"sheet":"Totali","index":8,"n_rows":14,"n_cols":6,"rows_kept":14,"cut":false,"hidden":false,"merged":[[1,2,2,5],[13,2,13,4],[10,2,10,4],[11,2,11,4],[12,2,12,4],[3,2,3,4],[4,2,4,4],[5,2,5,4],[6,2,6,4],[8,2,8,4]]}
[]
[null,null,"TOTALE VOTANTI SENATO"]
[]
[]
[null,null,"Maschi",null,null,{"$f":"SUM(SEZ.1!E5,SEZ.2!E5,SEZ.3!E5,SEZ.4!E5,SEZ.5!E5,SEZ.6!E5)","v":1646}]
[null,null,"Femmine",null,null,{"$f":"SUM(SEZ.1!E6,SEZ.2!E6,SEZ.3!E6,SEZ.4!E6,SEZ.5!E6,SEZ.6!E6)","v":1682}]
[null,null,"TOTALE VOTANTI",null,null,{"$f":"SUM(F5:F6)","v":3328}]
[]
[null,null,"Totale VOTI VALIDI",null,null,{"$f":"SUM(SEZ.1!E9,SEZ.2!E9,SEZ.3!E9,SEZ.4!E9,SEZ.5!E9,SEZ.6!E9)","v":0}]
[]
[null,null,"SCHEDE BIANCHE",null,null,{"$f":"SUM(SEZ.1!E11,SEZ.2!E11,SEZ.3!E11,SEZ.4!E11,SEZ.5!E11,SEZ.6!E11)","v":79}]
[null,null,"SCHEDE NULLE",null,null,{"$f":"SUM(SEZ.1!E12,SEZ.2!E12,SEZ.3!E12,SEZ.4!E12,SEZ.5!E12,SEZ.6!E12)","v":84}]
[null,null,"SCHEDE contestate e provvisoriamente non attribuite",null,null,{"$f":"SUM(SEZ.1!E13,SEZ.2!E13,SEZ.3!E13,SEZ.4!E13,SEZ.5!E13,SEZ.6!E13)","v":0}]
[null,null,"Totale Schede NON VALIDE",null,null,{"$f":"SUM(F11:F13)","v":163}]

{"sheet":"1","index":9,"n_rows":41,"n_cols":9,"rows_kept":41,"cut":false,"hidden":false,"merged":[[32,1,32,2],[1,1,1,7],[23,2,26,2],[23,1,26,1],[10,2,13,2],[10,1,13,1]]}
[]
[null,"SCRUTINIO SENATO - SEZIONE 1"]
[]
[null,"NUMERO CANDIDATO UNINOMINALE","COGNOME E NOME","TOTALE VOTI VALIDI CANDIDATO UNINOMINALE","DI CUI VOTI ESPRESSI AL SOLO CANDIDATO UNINOMINALE","N. LISTE","LISTA COLLEGATA","VOTI ESPRESSI PER LE LISTE"]
[null,1,"BIZZARRO Francecso",{"$f":"SUM(E5,H5)","v":7},null,1,"ITALIA AGLI ITALIANI",7]
[]
[null,2,"MARTIGNANO Carlo",{"$f":"SUM(E7,H7)","v":3},null,1,"POTERE AL POPOLO",3]
[]
[null,3,"ROMANO Girolamo",{"$f":"SUM(E9,H9)","v":1},null,1,"LISTA DEL POPOLO",1]
[null,null,"BELLANOVA Teresa",{"$f":"SUM(D11:D14)","v":65},{"$f":"SUM(E11:E14)","v":0}]
[null,4,"BELLANOVA Teresa",{"$f":"SUM(E11,H11)","v":4},null,1,"ITALIA EUROPA INSIEME",4]
[null,null,null,{"$f":"SUM(E12,H12)","v":54},null,2,"PARTITO DEMOCRATICO",54]
[null,null,null,{"$f":"SUM(E13,H13)","v":5},null,3,"CIVICA POPOLARE LORENZIN",5]
[null,null,null,{"$f":"SUM(E14,H14)","v":2},null,4,"+EUROPA",2]
[]
[null,5,"DE CARLO Marco",{"$f":"SUM(E16,H16)","v":5},1,1,"IL POPOLO DELLA FAMIGLIA",4]
[]
[null,6,"ADASHA Morgan Daysi",{"$f":"SUM(E18,H18)","v":1},null,1,"PARTITO COMUNISTA",1]
[]
[null,7,"LECCISO Felice",{"$f":"SUM(E20,H20)","v":1},null,1,"CASAPOUND ITALIA",1]
{"$rows_left_out":22}
{"sheet":"2","index":10,"n_rows":41,"n_cols":9,"rows_kept":41,"cut":false,"hidden":false,"merged":[[32,1,32,2],[1,1,1,7],[10,1,13,1],[10,2,13,2],[23,1,26,1],[23,2,26,2]]}
[]
[null,"SCRUTINIO SENATO - SEZIONE 2"]
[]
[null,"NUMERO CANDIDATO UNINOMINALE","COGNOME E NOME","TOTALE VOTI VALIDI CANDIDATO UNINOMINALE","DI CUI VOTI ESPRESSI AL SOLO CANDIDATO UNINOMINALE","N. LISTE","LISTA COLLEGATA","VOTI ESPRESSI PER LE LISTE"]
[null,1,"BIZZARRO Francecso",{"$f":"SUM(E5,H5)","v":5},null,1,"ITALIA AGLI ITALIANI",5]
[]
[null,2,"MARTIGNANO Carlo",{"$f":"SUM(E7,H7)","v":2},null,1,"POTERE AL POPOLO",2]
[]
[null,3,"ROMANO Girolamo",{"$f":"SUM(E9,H9)","v":1},null,1,"LISTA DEL POPOLO",1]
[null,null,"BELLANOVA Teresa",{"$f":"SUM(D11:D14)","v":105},{"$f":"SUM(E11:E14)","v":25}]
[null,4,"BELLANOVA Teresa",{"$f":"SUM(E11,H11)","v":3},null,1,"ITALIA EUROPA INSIEME",3]
[null,null,null,{"$f":"SUM(E12,H12)","v":95},25,2,"PARTITO DEMOCRATICO",70]
[null,null,null,{"$f":"SUM(E13,H13)","v":4},null,3,"CIVICA POPOLARE LORENZIN",4]
[null,null,null,{"$f":"SUM(E14,H14)","v":3},null,4,"+EUROPA",3]
[]
[null,5,"DE CARLO Marco",{"$f":"SUM(E16,H16)","v":7},null,1,"IL POPOLO DELLA FAMIGLIA",7]
[]
[null,6,"ADASHA Morgan Daysi",{"$f":"SUM(E18,H18)","v":1},null,1,"PARTITO COMUNISTA",1]
[]
[null,7,"LECCISO Felice",{"$f":"SUM(E20,H20)","v":0},null,1,"CASAPOUND ITALIA"]
{"$rows_left_out":22}
{"sheet":"3","index":11,"n_rows":41,"n_cols":9,"rows_kept":41,"cut":false,"hidden":false,"merged":[[1,1,1,7],[32,1,32,2],[10,1,13,1],[10,2,13,2],[23,1,26,1],[23,2,26,2]]}
[]
[null,"SCRUTINIO SENATO - SEZIONE 3"]
[]
[null,"NUMERO CANDIDATO UNINOMINALE","COGNOME E NOME","TOTALE VOTI VALIDI CANDIDATO UNINOMINALE","DI CUI VOTI ESPRESSI AL SOLO CANDIDATO UNINOMINALE","N. LISTE","LISTA COLLEGATA","VOTI ESPRESSI PER LE LISTE"]
[null,1,"BIZZARRO Francecso",{"$f":"SUM(E5,H5)","v":6},0,1,"ITALIA AGLI ITALIANI",6]
[]
[null,2,"MARTIGNANO Carlo",{"$f":"SUM(E7,H7)","v":2},0,1,"POTERE AL POPOLO",2]
[]
[null,3,"ROMANO Girolamo",{"$f":"SUM(E9,H9)","v":0},null,1,"LISTA DEL POPOLO"]
[null,null,"BELLANOVA Teresa",{"$f":"SUM(D11:D14)","v":60}]
[null,4,"BELLANOVA Teresa",{"$f":"SUM(E11,H11)","v":1},null,1,"ITALIA EUROPA INSIEME",1]
[null,null,null,{"$f":"SUM(E12,H12)","v":56},2,2,"PARTITO DEMOCRATICO",54]
[null,null,null,{"$f":"SUM(E13,H13)","v":1},null,3,"CIVICA POPOLARE LORENZIN",1]
[null,null,null,{"$f":"SUM(E14,H14)","v":2},null,4,"+EUROPA",2]
[]
[null,5,"DE CARLO Marco",{"$f":"SUM(E16,H16)","v":4},null,1,"IL POPOLO DELLA FAMIGLIA",4]
[]
[null,6,"ADASHA Morgan Daysi",{"$f":"SUM(E18,H18)","v":2},null,1,"PARTITO COMUNISTA",2]
[]
[null,7,"LECCISO Felice",{"$f":"SUM(E20,H20)","v":0},null,1,"CASAPOUND ITALIA"]
{"$rows_left_out":22}
{"sheet":"4","index":12,"n_rows":41,"n_cols":9,"rows_kept":41,"cut":false,"hidden":false,"merged":[[1,1,1,7],[32,1,32,2],[10,1,13,1],[10,2,13,2],[23,1,26,1],[23,2,26,2]]}
[]
[null,"SCRUTINIO SENATO - SEZIONE 4"]
[]
[null,"NUMERO CANDIDATO UNINOMINALE","COGNOME E NOME","TOTALE VOTI VALIDI CANDIDATO UNINOMINALE","DI CUI VOTI ESPRESSI AL SOLO CANDIDATO UNINOMINALE","N. LISTE","LISTA COLLEGATA","VOTI ESPRESSI PER LE LISTE"]
[null,1,"BIZZARRO Francecso",{"$f":"SUM(E5,H5)","v":9},0,1,"ITALIA AGLI ITALIANI",9]
[]
[null,2,"MARTIGNANO Carlo",{"$f":"SUM(E7,H7)","v":4},2,1,"POTERE AL POPOLO",2]
[]
[null,3,"ROMANO Girolamo",{"$f":"SUM(E9,H9)","v":1},0,1,"LISTA DEL POPOLO",1]
[null,null,"BELLANOVA Teresa",{"$f":"SUM(D11:D14)","v":93}]
[null,4,"BELLANOVA Teresa",{"$f":"SUM(E11,H11)","v":7},5,1,"ITALIA EUROPA INSIEME",2]
[null,null,null,{"$f":"SUM(E12,H12)","v":83},null,2,"PARTITO DEMOCRATICO",83]
[null,null,null,{"$f":"SUM(E13,H13)","v":0},null,3,"CIVICA POPOLARE LORENZIN",0]
[null,null,null,{"$f":"SUM(E14,H14)","v":3},null,4,"+EUROPA",3]
[]
[null,5,"DE CARLO Marco",{"$f":"SUM(E16,H16)","v":11},0,1,"IL POPOLO DELLA FAMIGLIA",11]
[]
[null,6,"ADASHA Morgan Daysi",{"$f":"SUM(E18,H18)","v":1},0,1,"PARTITO COMUNISTA",1]
[]
[null,7,"LECCISO Felice",{"$f":"SUM(E20,H20)","v":3},0,1,"CASAPOUND ITALIA",3]
{"$rows_left_out":22}
{"sheet":"5","index":13,"n_rows":41,"n_cols":9,"rows_kept":41,"cut":false,"hidden":false,"merged":[[1,1,1,7],[32,1,32,2],[10,1,13,1],[10,2,13,2],[23,1,26,1],[23,2,26,2]]}
[]
[null,"SCRUTINIO SENATO - SEZIONE 5"]
[]
[null,"NUMERO CANDIDATO UNINOMINALE","COGNOME E NOME","TOTALE VOTI VALIDI CANDIDATO UNINOMINALE","DI CUI VOTI ESPRESSI AL SOLO CANDIDATO UNINOMINALE","N. LISTE","LISTA COLLEGATA","VOTI ESPRESSI PER LE LISTE"]
[null,1,"BIZZARRO Francecso",{"$f":"SUM(E5,H5)","v":4},1,1,"ITALIA AGLI ITALIANI",3]
[]
[null,2,"MARTIGNANO Carlo",{"$f":"SUM(E7,H7)","v":3},null,1,"POTERE AL POPOLO",3]
[]
[null,3,"ROMANO Girolamo",{"$f":"SUM(E9,H9)","v":0},null,1,"LISTA DEL POPOLO"]
[null,null,"BELLANOVA Teresa",{"$f":"SUM(D11:D14)","v":79},{"$f":"SUM(E11:E14)","v":2}]
[null,4,"BELLANOVA Teresa",{"$f":"SUM(E11,H11)","v":0},null,1,"ITALIA EUROPA INSIEME"]
[null,null,null,{"$f":"SUM(E12,H12)","v":72},2,2,"PARTITO DEMOCRATICO",70]
[null,null,null,{"$f":"SUM(E13,H13)","v":0},null,3,"CIVICA POPOLARE LORENZIN",0]
[null,null,null,{"$f":"SUM(E14,H14)","v":7},null,4,"+EUROPA",7]
[]
[null,5,"DE CARLO Marco",{"$f":"SUM(E16,H16)","v":1},null,1,"IL POPOLO DELLA FAMIGLIA",1]
[]
[null,6,"ADASHA Morgan Daysi",{"$f":"SUM(E18,H18)","v":3},null,1,"PARTITO COMUNISTA",3]
[]
[null,7,"LECCISO Felice",{"$f":"SUM(E20,H20)","v":1},null,1,"CASAPOUND ITALIA",1]
{"$rows_left_out":22}
{"sheet":"6","index":14,"n_rows":41,"n_cols":9,"rows_kept":41,"cut":false,"hidden":false,"merged":[[1,1,1,7],[32,1,32,2],[10,1,13,1],[10,2,13,2],[23,1,26,1],[23,2,26,2]]}
[]
[null,"SCRUTINIO SENATO - SEZIONE 6"]
[]
[null,"N. CANDIDATO UNINOMINALE","COGNOME E NOME","TOTALE VOTI VALIDI CANDIDATO UNINOMINALE","DI CUI VOTI ESPRESSI AL SOLO CANDIDATO UNINOMINALE","N. LISTE","LISTA COLLEGATA","VOTI ESPRESSI PER LE LISTE"]
[null,1,"BIZZARRO Francecso",{"$f":"SUM(E5,H5)","v":8},1,1,"ITALIA AGLI ITALIANI",7]
[]
[null,2,"MARTIGNANO Carlo",{"$f":"SUM(E7,H7)","v":5},0,1,"POTERE AL POPOLO",5]
[]
[null,3,"ROMANO Girolamo",{"$f":"SUM(E9,H9)","v":0},0,1,"LISTA DEL POPOLO",0]
[null,null,"BELLANOVA Teresa",{"$f":"SUM(D11:D14)","v":72},{"$f":"SUM(E11:E14)","v":4}]
[null,4,"BELLANOVA Teresa",{"$f":"SUM(E11,H11)","v":2},null,1,"ITALIA EUROPA INSIEME",2]
[null,null,null,{"$f":"SUM(E12,H12)","v":61},4,2,"PARTITO DEMOCRATICO",57]
[null,null,null,{"$f":"SUM(E13,H13)","v":0},null,3,"CIVICA POPOLARE LORENZIN",0]
[null,null,null,{"$f":"SUM(E14,H14)","v":9},null,4,"+EUROPA",9]
[]
[null,5,"DE CARLO Marco",{"$f":"SUM(E16,H16)","v":8},0,1,"IL POPOLO DELLA FAMIGLIA",8]
[]
[null,6,"ADASHA Morgan Daysi",{"$f":"SUM(E18,H18)","v":1},0,1,"PARTITO COMUNISTA",1]
[]
[null,7,"LECCISO Felice",{"$f":"SUM(E20,H20)","v":1},0,1,"CASAPOUND ITALIA",1]
{"$rows_left_out":22}
{"sheet":"Candidati","index":15,"n_rows":14,"n_cols":4,"rows_kept":14,"cut":false,"hidden":false,"merged":[[2,1,2,2]]}
[]
[]
[null,"CANDIDATO",null,"VOTI"]
[null,1,{"$f":"Scrutinio!O7","v":"BIZZARRO"},{"$f":"Scrutinio!O17","v":39}]
[null,2,{"$f":"Scrutinio!P7","v":"MARTIGNANO"},{"$f":"Scrutinio!P17","v":19}]
[null,3,{"$f":"Scrutinio!Q7","v":"ROMANO"},{"$f":"Scrutinio!Q17","v":3}]
[null,4,{"$f":"Scrutinio!R7","v":"BELLANOVA"},{"$f":"Scrutinio!R17","v":474}]
[null,5,{"$f":"Scrutinio!S7","v":"DE CARLO"},{"$f":"Scrutinio!S17","v":36}]
[null,6,{"$f":"Scrutinio!T7","v":"ADASHA"},{"$f":"Scrutinio!T17","v":9}]
[null,7,{"$f":"Scrutinio!U7","v":"LECCISO"},{"$f":"Scrutinio!U17","v":6}]
[null,8,{"$f":"Scrutinio!V7","v":"LEZZI"},{"$f":"Scrutinio!V17","v":1020}]
[null,9,{"$f":"Scrutinio!W7","v":"CARIDDI"},{"$f":"Scrutinio!W17","v":1466}]
[null,10,{"$f":"Scrutinio!X7","v":"D'ALEMA"},{"$f":"Scrutinio!X17","v":91}]
[null,11,{"$f":"Scrutinio!Y7","v":"SCAVO"},{"$f":"Scrutinio!Y17","v":2}]