{"text_format":"1","workbook":"xlsx","n_sheets":16,"sheets":["Votanti","Scrutinio","SEZ. 1","SEZ. 2","SEZ. 3","SEZ. 4","SEZ. 5","SEZ. 6","Totali","1","2","3","4","5","6","Candidati"],"not_rendered":{"charts":0,"images":2,"macros":1,"external_links":0,"defined_names":0,"comments":0,"pivot_tables":0},"unopened":[],"bounds":{"document_bytes":16777216,"sheet_cells":100000,"rows_first":2000,"rows_last":500,"rows_between":2000,"halvings":0,"cell_chars":16384,"cell_head_chars":4096},"cells_cut":0,"cells_raw":0,"read":"whole","date_system":"1900"}

{"sheet":"Votanti","index":0,"n_rows":14,"n_cols":20,"rows_kept":14,"cut":false,"hidden":false,"merged":[[1,1,1,19],[3,6,4,7],[3,2,3,4],[4,2,4,4],[4,15,4,17],[3,15,3,17],[2,6,2,7],[2,10,2,11],[3,10,4,11]]}
[]
[null,"ELEZIONI POLITICHE del 4 marzo 2018 - CAMERA dei DEPUTATI"]
[null,null,null,null,null,null,"VOTANTI ORE",null,null,null,"VOTANTI ORE"]
[null,null,"TOTALE ELETTORI",null,null,null,null,null,null,null,null,null,null,null,null,"VOTANTI"]
[null,null,"CAMERA",null,null,null,null,null,null,null,null,null,null,null,null,"Chiusura Seggi"]
[null,"SEZ","M","F","TOT",null,"SEZ","TOTALE",null,null,"SEZ","TOTALE",null,null,"SEZ","M","F","TOT","SEZ"]
[null,1,417,446,{"$f":"SUM(C7:D7)","v":863},null,1,152,{"$f":"IF(E7>0,SUM(H7/E7%/100),\"\")","v":0.1761297798377752},null,1,504,{"$f":"IF(I7>0,SUM(L7/E7%/100),\"\")","v":0.58400926998841241},null,1,319,308,{"$f":"SUM(P7:Q7)","v":627},1,{"$f":"IF(M7>0,SUM(R7/E7%/100),\"\")","v":0.72653534183082269}]
[null,2,354,419,{"$f":"SUM(C8:D8)","v":773},null,2,129,0.16688227684346699,null,2,427,{"$f":"IF(I8>0,SUM(L8/E8%/100),\"\")","v":0.55239327296248375},null,2,266,302,568,2,{"$f":"IF(M8>0,SUM(R8/E8%/100),\"\")","v":0.7347994825355757}]
[null,3,367,430,797,null,3,96,0.1204516938519448,null,3,404,0.50690087829360098,null,3,264,268,532,3,0.66750313676286066]
[null,4,478,525,1003,null,4,169,0.16849451645064806,null,4,590,0.58823529411764708,null,4,361,379,740,4,0.7377866400797608]
[null,5,406,422,828,null,5,132,0.15942028985507248,null,5,431,0.52053140096618367,null,5,306,287,593,5,0.71618357487922713]
[null,6,391,447,838,null,6,128,0.15274463007159902,null,6,467,0.55727923627684961,null,6,285,296,581,6,0.69331742243436745]
[null,null,{"$f":"SUM(C7:C12)","v":2413},{"$f":"SUM(D7:D12)","v":2689},{"$f":"SUM(E7:E12)","v":5102},null,null,{"$f":"SUM(H7:H12)","v":806},null,null,null,{"$f":"SUM(L7:L12)","v":2823},null,null,null,{"$f":"SUM(P7:P12)","v":1801},{"$f":"SUM(Q7:Q12)","v":1840},3641]
[null,null,{"$f":"IF(C13>0,SUM(C13/E13%/100),\"0%\")","v":0.47295178361426893},{"$f":"IF(D13>0,SUM(D13/E13%/100),\"0%\")","v":0.52704821638573107},{"$f":"SUM(C14:D14)","v":1},null,null,{"$f":"IF(H13>0,SUM(H13/E13%/100),\"0%\")","v":0.15797726381811053},null,null,null,{"$f":"IF(L13>0,SUM(L13/E13%/100),\"0%\")","v":0.55331242649941192},null,null,null,{"$f":"IF(P13>0,SUM(P13/C13%/100),\"0%\")","v":0.74637380853709079},{"$f":"IF(Q13>0,SUM(Q13/D13%/100),\"0%\")","v":0.68426924507251774},{"$f":"IF(R13>0,SUM(R13/E13%/100),\"0%\")","v":0.71364170913367309}]

{"sheet":"Scrutinio","index":1,"n_rows":31,"n_cols":29,"rows_kept":31,"cut":false,"hidden":false,"merged":[[3,20,3,25],[6,18,9,18],[6,19,9,19],[6,20,9,20],[6,21,9,21],[3,14,3,19],[6,17,9,17],[6,22,9,22],[6,23,9,23],[6,24,9,24],[6,25,9,25],[6,14,9,14],[6,15,9,15],[6,16,9,16],[4,14,4,25],[5,1,5,5],[8,2,8,4],[8,10,8,13],[31,13,31,16],[18,2,18,4],[18,5,18,7],[8,5,8,7]]}
[]
[]
[]
[null,null,null,null,null,null,null,null,null,null,null,null,null,null,{"$f":"SUM(B16)","v":6},null,null,null,null,null,{"$f":"IF(O4=0,\"sezioni su 6\",IF(O4=1,\"sezione su 6\",\"sezioni su 6\"))","v":"sezioni su 6"}]
[]
[null,null,null,null,null,null,null,null,null,null,null,null,null,null,1,2,3,4,5,6,7,8,9,10,11,12]
[null,null,null,null,null,null,null,null,null,null,null,null,null,null,"DURANTE","SIMMINI","DE LUCA","ALEMANNO","DE CARLO","BLASI","CAMASSA","RISI","CITTA","BALDASSARRE","GIURI","CAROPPO"]
[]
[null,null,"ELETTORI",null,null,"VOTANTI",null,null,null,null,"VOTI NON VALIDI",null,null,null,null,"Rocco Antonio","Luigi","Giuseppe",null,"Rocco Antonio","Luigi","Giuseppe",null,"Rocco Antonio","Luigi","Giuseppe"]
[null,"SEZ","M","F","TOT","M","F","TOT","% VOTANTI","SEZ","BIANCHE","NULLE","CONTESTATE O NON ATTRIBUITE","TOT.",null,"CONTE","ARCUTI","MENALLO",null,"CONTE","ARCUTI","MENALLO",null,"CONTE","ARCUTI","MENALLO"]
[null,1,{"$f":"Votanti!C7","v":417},{"$f":"Votanti!D7","v":446},{"$f":"Votanti!E7","v":863},{"$f":"Votanti!P7","v":319},{"$f":"Votanti!Q7","v":308},{"$f":"SUM(F11:G11)","v":627},{"$f":"Votanti!T7","v":0.72653534183082269},1,{"$f":"'SEZ. 1'!$E$11","v":14},{"$f":"'SEZ. 1'!$E$12","v":12},{"$f":"'SEZ. 1'!$E$13","v":0},{"$f":"SUM(K11:M11)","v":26},{"$f":"'1'!$D$5","v":1},{"$f":"'1'!$D$7","v":4},{"$f":"'1'!$D$9","v":0},{"$f":"'1'!$D$11","v":196},{"$f":"'1'!$D$13","v":4},{"$f":"'1'!$D$14","v":67},{"$f":"'1'!$D$20","v":0},{"$f":"'1'!$D$22","v":9},{"$f":"'1'!$D$24","v":0},{"$f":"'1'!$D$26","v":5},{"$f":"'1'!$D$28","v":3},{"$f":"'1'!$D$29","v":312},{"$f":"SUM(O11:Z11,N11)","v":627},{"$f":"IF(AC11=\"OK\",1,\"\")","v":""},{"$f":"IF(H11>\"0\",IF(H11=AA11,\"OK\",H11-AA11),\"\")","v":""}]
[null,2,{"$f":"Votanti!C8","v":354},{"$f":"Votanti!D8","v":419},{"$f":"Votanti!E8","v":773},{"$f":"Votanti!P8","v":266},{"$f":"Votanti!Q8","v":302},{"$f":"SUM(F12:G12)","v":568},{"$f":"Votanti!T8","v":0.7347994825355757},2,{"$f":"'SEZ. 2'!$E$11","v":6},{"$f":"'SEZ. 2'!$E$12","v":7},{"$f":"'SEZ. 2'!$E$13","v":0},{"$f":"SUM(K12:M12)","v":13},{"$f":"'2'!$D$5","v":1},{"$f":"'2'!$D$7","v":3},{"$f":"'2'!$D$9","v":1},{"$f":"'2'!$D$11","v":157},{"$f":"'2'!$D$13","v":5},{"$f":"'2'!$D$14","v":120},{"$f":"'2'!$D$20","v":3},{"$f":"'2'!$D$22","v":19},{"$f":"'2'!$D$24","v":1},{"$f":"'2'!$D$26","v":7},{"$f":"'2'!$D$28","v":0},{"$f":"'2'!$D$29","v":238},{"$f":"SUM(O12:Z12,N12)","v":568},{"$f":"IF(AC12=\"OK\",1,\"\")","v":""},{"$f":"IF(H12>\"0\",IF(H12=AA12,\"OK\",H12-AA12),\"\")","v":""}]
[null,3,{"$f":"Votanti!C9","v":367},{"$f":"Votanti!D9","v":430},{"$f":"Votanti!E9","v":797},{"$f":"Votanti!P9","v":264},{"$f":"Votanti!Q9","v":268},532,{"$f":"Votanti!T9","v":0.66750313676286066},3,{"$f":"'SEZ. 3'!$E$11","v":9},{"$f":"'SEZ. 3'!$E$12","v":6},{"$f":"'SEZ. 3'!$E$13","v":0},15,{"$f":"'3'!$D$5","v":1},{"$f":"'3'!$D$7","v":2},{"$f":"'3'!$D$9","v":1},{"$f":"'3'!$D$11","v":168},{"$f":"'3'!$D$13","v":2},{"$f":"'3'!$D$14","v":69},{"$f":"'3'!$D$20","v":2},{"$f":"'3'!$D$22","v":17},{"$f":"'3'!$D$24","v":0},{"$f":"'3'!$D$26","v":2},{"$f":"'3'!$D$28","v":2},{"$f":"'3'!$D$29","v":251},532,"",""]
[null,4,{"$f":"Votanti!C10","v":478},{"$f":"Votanti!D10","v":525},{"$f":"Votanti!E10","v":1003},{"$f":"Votanti!P10","v":361},{"$f":"Votanti!Q10","v":379},740,{"$f":"Votanti!T10","v":0.7377866400797608},4,{"$f":"'SEZ. 4'!$E$11","v":15},{"$f":"'SEZ. 4'!$E$12","v":10},{"$f":"'SEZ. 4'!$E$13","v":0},25,{"$f":"'4'!$D$5","v":1},{"$f":"'4'!$D$7","v":3},{"$f":"'4'!$D$9","v":3},{"$f":"'4'!$D$11","v":257},{"$f":"'4'!$D$13","v":9},{"$f":"'4'!$D$14","v":103},{"$f":"'4'!$D$20","v":1},{"$f":"'4'!$D$22","v":16},{"$f":"'4'!$D$24","v":0},{"$f":"'4'!$D$26","v":1},{"$f":"'4'!$D$28","v":3},{"$f":"'4'!$D$29","v":318},740,"",""]
[null,5,{"$f":"Votanti!C11","v":406},{"$f":"Votanti!D11","v":422},{"$f":"Votanti!E11","v":828},{"$f":"Votanti!P11","v":306},{"$f":"Votanti!Q11","v":287},593,{"$f":"Votanti!T11","v":0.71618357487922713},5,{"$f":"'SEZ. 5'!$E$11","v":7},{"$f":"'SEZ. 5'!$E$12","v":13},{"$f":"'SEZ. 5'!$E$13","v":0},20,{"$f":"'5'!$D$5","v":0},{"$f":"'5'!$D$7","v":4},{"$f":"'5'!$D$9","v":0},{"$f":"'5'!$D$11","v":182},{"$f":"'5'!$D$13","v":1},{"$f":"'5'!$D$14","v":93},{"$f":"'5'!$D$20","v":3},{"$f":"'5'!$D$22","v":14},{"$f":"'5'!$D$24","v":0},{"$f":"'5'!$D$26","v":3},{"$f":"'5'!$D$28","v":2},{"$f":"'5'!$D$29","v":271},593,"",""]
[null,6,{"$f":"Votanti!C12","v":391},{"$f":"Votanti!D12","v":447},{"$f":"Votanti!E12","v":838},{"$f":"Votanti!P12","v":285},{"$f":"Votanti!Q12","v":296},581,{"$f":"Votanti!T12","v":0.69331742243436745},6,{"$f":"'SEZ. 6'!$E$11","v":12},{"$f":"'SEZ. 6'!$E$12","v":28},{"$f":"'SEZ. 6'!$E$13","v":0},40,{"$f":"'6'!$D$5","v":2},{"$f":"'6'!$D$7","v":5},{"$f":"'6'!$D$9","v":0},{"$f":"'6'!$D$11","v":207},{"$f":"'6'!$D$13","v":9},{"$f":"'6'!$D$14","v":76},{"$f":"'6'!$D$20","v":0},{"$f":"'6'!$D$22","v":18},{"$f":"'6'!$D$24","v":0},{"$f":"'6'!$D$26","v":3},{"$f":"'6'!$D$28","v":3},{"$f":"'6'!$D$29","v":218},581,"",""]
[null,null,{"$f":"SUM(C11:C16)","v":2413},{"$f":"SUM(D11:D16)","v":2689},{"$f":"SUM(E11:E16)","v":5102},{"$f":"SUM(F11:F16)","v":1801},{"$f":"SUM(G11:G16)","v":1840},3641,{"$f":"Votanti!R14","v":0.71364170913367309},null,{"$f":"SUM(K11:K16)","v":63},{"$f":"SUM(L11:L16)","v":76},{"$f":"SUM(M11:M16)","v":0},{"$f":"SUM(K17:M17)","v":139},{"$f":"SUM(O11:O16)","v":6},21,5,1167,30,528,9,93,1,21,13,1608,3641]
[null,null,{"$f":"Votanti!C14","v":0.47295178361426893},{"$f":"Votanti!D14","v":0.52704821638573107},{"$f":"Votanti!E14","v":1},{"$f":"Votanti!P14","v":0.74637380853709079},{"$f":"Votanti!Q14","v":0.68426924507251774},{"$f":"Votanti!R14","v":0.71364170913367309},null,null,{"$f":"IFERROR(SUM(K17/$H$17%/100),0%)","v":1.7302938753089813E-2},2.0873386432298822E-2,0,{"$f":"IFERROR(SUM(N17/$H$17%/100),0%)","v":3.8176325185388632E-2},{"$f":"IFERROR(SUM(O17/$AA$17%/100),0%)","v":1.6478989288656965E-3},{"$f":"IFERROR(SUM(P17/$AA$17%/100),0%)","v":5.7676462510299377E-3},1.3732491073880804E-3,0.32051634166437792,8.2394946443284829E-3,0.14501510574018128,2.4718483932985448E-3,2.5542433397418293E-2,2.7464982147761609E-4,5.7676462510299377E-3,3.5704476792090089E-3,0.44163691293600665]
[null,null,"ELETTORI",null,null,"VOTANTI"]
[null,null,null,null,null,null,null,null,null,null,null,null,null,{"$f":"IF(Q20>0,RANK(Q20,$Q$20:$Q$31),\"\")","v":1},{"$f":"INDEX(Candidati!$C$4:$C$15,MATCH(LARGE(Candidati!$D$4:$D$15-ROW(Candidati!$D$4:$D$15)/100,ROW(N20)-ROW($K$19)),Candidati!$D$4:$D$15-ROW(Candidati!$D$4:$D$15)/100,0))","v":"CAROPPO"},null,{"$f":"VLOOKUP(O20,Candidati!$C$3:$D$15,2,0)","v":1608}]
{"$rows_left_out":12}
{"sheet":"SEZ. 1","index":2,"n_rows":18,"n_cols":6,"rows_kept":18,"cut":false,"hidden":false,"merged":[[1,2,2,4],[0,2,0,4],[3,2,3,4],[12,2,12,3],[6,2,6,3],[7,2,7,3],[9,2,9,3],[4,2,4,3],[5,2,5,3],[10,2,10,3],[11,2,11,3]]}
[]
[null,null,"CAMERA"]
[]
[]
[null,null,"Maschi",null,{"$f":"Votanti!P7","v":319}]
[null,null,"Femmine",null,{"$f":"Votanti!Q7","v":308}]
[null,null,"TOTALE VOTANTI",null,{"$f":"SUM(E5:E6)","v":627},{"$f":"IF(E9=\"\",\"\",IF(E7=(E9+E14),\"OK!\",\"ERRORE\"))","v":""}]
[]
[null,null,"a","TOTALE voti validi"]
[]
[null,null,"SCHEDE BIANCHE",null,14]
[null,null,"SCHEDE NULLE",null,12]
[null,null,"SCHEDE contestate e provvisoriamente non attribuite"]
[null,null,"b","TOTALE Schede NON VALIDE",{"$f":"SUM(E11:E13)","v":26}]
[]
[null,null,null,{"$f":"IF(E16<\"\",\"TOTALE (a) + (b)\",\"\")","v":""},{"$f":"IF(E9=\"\",\"\",IF(E9+E14=E7,\"\",E9+E14))","v":""}]
[]
[null,null,null,null,null,{"$f":"IF(E9=\"\",\"\",IF(E9+E14=E7,\"\",E9+E14-E7))","v":""}]

{"sheet":"SEZ. 2","index":3,"n_rows":18,"n_cols":6,"rows_kept":18,"cut":false,"hidden":false,"merged":[[0,2,0,4],[1,2,2,4],[3,2,3,4],[11,2,11,3],[12,2,12,3],[4,2,4,3],[5,2,5,3],[6,2,6,3],[10,2,10,3],[7,2,7,3],[9,2,9,3]]}
[]
[null,null,"CAMERA"]
[]
[]
[null,null,"Maschi",null,{"$f":"Votanti!P8","v":266}]
[null,null,"Femmine",null,{"$f":"Votanti!Q8","v":302}]
[null,null,"TOTALE VOTANTI",null,{"$f":"SUM(E5:E6)","v":568},{"$f":"IF(E12=\"\",\"\",IF(E7=(E9+E14),\"OK!\",\"ERRORE\"))","v":"ERRORE"}]
[]
[null,null,"a","TOTALE voti validi"]
[]
[null,null,"SCHEDE BIANCHE",null,6]
[null,null,"SCHEDE NULLE",null,7]
[null,null,"SCHEDE contestate e provvisoriamente non attribuite"]
[null,null,"b","TOTALE Schede NON VALIDE",{"$f":"SUM(E11:E13)","v":13}]
[]
[null,null,null,{"$f":"IF(E16<\"\",\"TOTALE (a) + (b)\",\"\")","v":""},{"$f":"IF(E9=\"\",\"\",IF(E9+E14=E7,\"\",E9+E14))","v":""}]
[]
[null,null,null,null,null,{"$f":"IF(E9=\"\",\"\",IF(E9+E14=E7,\"\",E9+E14-E7))","v":""}]

{"sheet":"SEZ. 3","index":4,"n_rows":18,"n_cols":6,"rows_kept":18,"cut":false,"hidden":false,"merged":[[9,2,9,3],[0,2,0,4],[1,2,2,4],[11,2,11,3],[12,2,12,3],[4,2,4,3],[5,2,5,3],[6,2,6,3],[10,2,10,3],[7,2,7,3],[3,2,3,4]]}
[]
[null,null,"CAMERA"]
[]
[]
[null,null,"Maschi",null,{"$f":"Votanti!P9","v":264}]
[null,null,"Femmine",null,{"$f":"Votanti!Q9","v":268}]
[null,null,"TOTALE VOTANTI",null,{"$f":"SUM(E5:E6)","v":532},{"$f":"IF(E12=\"\",\"\",IF(E7=(E9+E14),\"OK!\",\"ERRORE\"))","v":"ERRORE"}]
[]
[null,null,"a","TOTALE voti validi"]
[]
[null,null,"SCHEDE BIANCHE",null,9]
[null,null,"SCHEDE NULLE",null,6]
[null,null,"SCHEDE contestate e provvisoriamente non attribuite"]
[null,null,"b","TOTALE Schede NON VALIDE",{"$f":"SUM(E11:E13)","v":15}]
[]
[null,null,null,{"$f":"IF(E16<\"\",\"TOTALE (a) + (b)\",\"\")","v":""},{"$f":"IF(E9=\"\",\"\",IF(E9+E14=E7,\"\",E9+E14))","v":""}]
[]
[null,null,null,null,null,{"$f":"IF(E9=\"\",\"\",IF(E9+E14=E7,\"\",E9+E14-E7))","v":""}]

{"sheet":"SEZ. 4","index":5,"n_rows":16,"n_cols":6,"rows_kept":16,"cut":false,"hidden":false,"merged":[[9,2,9,3],[0,2,0,4],[1,2,2,4],[11,2,11,3],[12,2,12,3],[4,2,4,3],[5,2,5,3],[6,2,6,3],[10,2,10,3],[7,2,7,3],[3,2,3,4]]}
[]
[null,null,"CAMERA"]
[]
[]
[null,null,"Maschi",null,{"$f":"Votanti!P10","v":361}]
[null,null,"Femmine",null,{"$f":"Votanti!Q10","v":379}]
[null,null,"TOTALE VOTANTI",null,{"$f":"SUM(E5:E6)","v":740},{"$f":"IF(E9=\"\",\"\",IF(E7=(E9+E14),\"OK!\",\"ERRORE\"))","v":""}]
[]
[null,null,"a","TOTALE voti validi"]
[]
[null,null,"SCHEDE BIANCHE",null,15]
[null,null,"SCHEDE NULLE",null,10]
[null,null,"SCHEDE contestate e provvisoriamente non attribuite"]
[null,null,"b","TOTALE Schede NON VALIDE",{"$f":"SUM(E11:E13)","v":25}]
[]
[null,null,null,{"$f":"IF(E16<\"\",\"TOTALE (a) + (b)\",\"\")","v":""},{"$f":"IF(E9=\"\",\"\",IF(E9+E14=E7,\"\",E9+E14))","v":""},{"$f":"IF(E9=\"\",\"\",IF(E9+E14=E7,\"\",E9+E14-E7))","v":""}]

{"sheet":"SEZ. 5","index":6,"n_rows":16,"n_cols":6,"rows_kept":16,"cut":false,"hidden":false,"merged":[[9,2,9,3],[0,2,0,4],[1,2,2,4],[11,2,11,3],[12,2,12,3],[4,2,4,3],[5,2,5,3],[6,2,6,3],[10,2,10,3],[7,2,7,3],[3,2,3,4]]}
[]
[null,null,"CAMERA"]
[]
[]
[null,null,"Maschi",null,{"$f":"Votanti!P11","v":306}]
[null,null,"Femmine",null,{"$f":"Votanti!Q11","v":287}]
[null,null,"TOTALE VOTANTI",null,{"$f":"SUM(E5:E6)","v":593},{"$f":"IF(E9=\"\",\"\",IF(E7=(E9+E14),\"OK!\",\"ERRORE\"))","v":""}]
[]
[null,null,"a","TOTALE voti validi"]
[]
[null,null,"SCHEDE BIANCHE",null,7]
[null,null,"SCHEDE NULLE",null,13]
[null,null,"SCHEDE contestate e provvisoriamente non attribuite"]
[null,null,"b","TOTALE Schede NON VALIDE",{"$f":"SUM(E11:E13)","v":20}]
[]
[null,null,null,{"$f":"IF(E16<\"\",\"TOTALE (a) + (b)\",\"\")","v":""},{"$f":"IF(E9=\"\",\"\",IF(E9+E14=E7,\"\",E9+E14))","v":""},{"$f":"IF(E9=\"\",\"\",IF(E9+E14=E7,\"\",E9+E14-E7))","v":""}]

{"sheet":"SEZ. 6","index":7,"n_rows":16,"n_cols":6,"rows_kept":16,"cut":false,"hidden":false,"merged":[[9,2,9,3],[0,2,0,4],[1,2,2,4],[11,2,11,3],[12,2,12,3],[4,2,4,3],[5,2,5,3],[6,2,6,3],[10,2,10,3],[7,2,7,3],[3,2,3,4]]}
[]
[null,null,"CAMERA"]
[]
[]
[null,null,"Maschi",null,{"$f":"Votanti!P12","v":285}]
[null,null,"Femmine",null,{"$f":"Votanti!Q12","v":296}]
[null,null,"TOTALE VOTANTI",null,{"$f":"SUM(E5:E6)","v":581},{"$f":"IF(E9=\"\",\"\",IF(E7=(E9+E14),\"OK!\",\"ERRORE\"))","v":""}]
[]
[null,null,"a","TOTALE voti validi"]
[]
[null,null,"SCHEDE BIANCHE",null,12]
[null,null,"SCHEDE NULLE",null,28]
[null,null,"SCHEDE contestate e provvisoriamente non attribuite"]
[null,null,"b","TOTALE Schede NON VALIDE",{"$f":"SUM(E11:E13)","v":40}]
[]
[null,null,null,{"$f":"IF(E16<\"\",\"TOTALE (a) + (b)\",\"\")","v":""},{"$f":"IF(E9=\"\",\"\",IF(E9+E14=E7,\"\",E9+E14))","v":""},{"$f":"IF(E9=\"\",\"\",IF(E9+E14=E7,\"\",E9+E14-E7))","v":""}]

{"sheet":"Totali","index":8,"n_rows":14,"n_cols":6,"rows_kept":14,"cut":false,"hidden":false,"merged":[[8,2,8,4],[0,2,0,4],[1,2,2,5],[13,2,13,4],[10,2,10,4],[11,2,11,4],[12,2,12,4],[3,2,3,4],[4,2,4,4],[5,2,5,4],[6,2,6,4]]}
[]
[null,null,"TOTALI CAMERA"]
[]
[]
[null,null,"Maschi",null,null,{"$f":"SUM('SEZ. 1'!E5,'SEZ. 2'!E5,'SEZ. 3'!E5,'SEZ. 4'!E5,'SEZ. 5'!E5,'SEZ. 6'!E5)","v":1801}]
[null,null,"Femmine",null,null,{"$f":"SUM('SEZ. 1'!E6,'SEZ. 2'!E6,'SEZ. 3'!E6,'SEZ. 4'!E6,'SEZ. 5'!E6)","v":1544}]
[null,null,"TOTALE VOTANTI",null,null,{"$f":"SUM(F5:F6)","v":3345}]
[]
[null,null,"Totale VOTI VALIDI",null,null,{"$f":"SUM('SEZ. 1'!E9,'SEZ. 2'!E9,'SEZ. 3'!E9,'SEZ. 4'!E9,'SEZ. 5'!E9,'SEZ. 6'!E9)","v":0}]
[]
[null,null,"SCHEDE BIANCHE",null,null,{"$f":"SUM('SEZ. 1'!E11,'SEZ. 2'!E11,'SEZ. 3'!E11,'SEZ. 4'!E11,'SEZ. 5'!E11,'SEZ. 6'!E11)","v":63}]
[null,null,"SCHEDE NULLE",null,null,{"$f":"SUM('SEZ. 1'!E12,'SEZ. 2'!E12,'SEZ. 3'!E12,'SEZ. 4'!E12,'SEZ. 5'!E12,'SEZ. 6'!E12)","v":76}]
[null,null,"SCHEDE contestate e provvisoriamente non attribuite",null,null,{"$f":"SUM('SEZ. 1'!E13,'SEZ. 2'!E13,'SEZ. 3'!E13,'SEZ. 4'!E13,'SEZ. 5'!E13,'SEZ. 6'!E13)","v":0}]
[null,null,"Totale Schede NON VALIDE",null,null,{"$f":"SUM(F11:F13)","v":139}]

{"sheet":"1","index":9,"n_rows":42,"n_cols":9,"rows_kept":42,"cut":false,"hidden":false,"merged":[[33,1,33,2],[1,1,1,7],[14,1,17,1],[14,2,17,2],[29,1,32,1],[29,2,32,2]]}
[]
[null,"SCRUTINIO CAMERA - SEZIONE 1"]
[]
[null,"NUMERO CANDIDATO UNINOMINALE","COGNOME E NOME","TOTALE VOTI VALIDI CANDIDATO UNINOMINALE","DI CUI VOTI ESPRESSI AL SOLO CANDIDATO UNINOMINALE","N. LISTE","LISTA COLLEGATA","VOTI ESPRESSI PER LE LISTE"]
[null,1,"DURANTE Luca",{"$f":"SUM(E5,H5)","v":1},0,1,"10 VOLTE MEGLIO",1]
[]
[null,2,"SIMMINI Maria detta Mariagrazia",{"$f":"SUM(E7,H7)","v":4},0,1,"POTERE AL POPOLO",4]
[]
[null,3,"DE LUCA Elena",0,0,1,"PARTITO VALORE UMANO",0]
[]
[null,4,"ALEMANNO Maria Soave",196,10,1,"MOVIMENTO 5 STELLE",186]
[]
[null,5,"DE CARLO Maria Luisa",4,1,1,"IL POPOLO DELLA FAMIGLIA",3]
[null,null,"BLASI Sergio",{"$f":"SUM(D15:D18)","v":67},{"$f":"SUM(E15:E18)","v":0}]
[null,6,"BLASI Sergio",1,0,1,"CIVICA POPOLARE LORENZIN",1]
[null,null,null,3,null,2,"+EUROPA",3]
[null,null,null,63,null,3,"PARTITO DEMOCRATICO",63]
[null,null,null,0,null,4,"ITALIA EUROPA INSIEME",0]
[]
[null,7,"CAMASSA Barbara",0,0,1,"PARTITO COMUNISTA",0]
{"$rows_left_out":23}
{"sheet":"2","index":10,"n_rows":42,"n_cols":9,"rows_kept":42,"cut":false,"hidden":false,"merged":[[33,1,33,2],[1,1,1,7],[14,1,17,1],[14,2,17,2],[29,1,32,1],[29,2,32,2]]}
[]
[null,"SCRUTINIO CAMERA - SEZIONE 2"]
[]
[null,"NUMERO CANDIDATO UNINOMINALE","COGNOME E NOME","TOTALE VOTI VALIDI CANDIDATO UNINOMINALE","DI CUI VOTI ESPRESSI AL SOLO CANDIDATO UNINOMINALE","N. LISTE","LISTA COLLEGATA","VOTI ESPRESSI PER LE LISTE"]
[null,1,"DURANTE Luca",{"$f":"SUM(E5,H5)","v":1},null,1,"10 VOLTE MEGLIO",1]
[]
[null,2,"SIMMINI Maria detta Mariagrazia",{"$f":"SUM(E7,H7)","v":3},null,1,"POTERE AL POPOLO",3]
[]
[null,3,"DE LUCA Elena",1,null,1,"PARTITO VALORE UMANO",1]
[]
[null,4,"ALEMANNO Maria Soave",157,6,1,"MOVIMENTO 5 STELLE",151]
[]
[null,5,"DE CARLO Maria Luisa",5,null,1,"IL POPOLO DELLA FAMIGLIA",5]
[null,null,"BLASI Sergio",{"$f":"SUM(D15:D18)","v":120},{"$f":"SUM(E15:E18)","v":29}]
[null,6,"BLASI Sergio",4,null,1,"CIVICA POPOLARE LORENZIN",4]
[null,null,null,2,null,2,"+EUROPA",2]
[null,null,null,111,29,3,"PARTITO DEMOCRATICO",82]
[null,null,null,3,null,4,"ITALIA EUROPA INSIEME",3]
[]
[null,7,"CAMASSA Barbara",3,1,1,"PARTITO COMUNISTA",2]
{"$rows_left_out":23}
{"sheet":"3","index":11,"n_rows":42,"n_cols":9,"rows_kept":42,"cut":false,"hidden":false,"merged":[[33,1,33,2],[1,1,1,7],[14,1,17,1],[14,2,17,2],[29,1,32,1],[29,2,32,2]]}
[]
[null,"SCRUTINIO CAMERA - SEZIONE 3"]
[]
[null,"NUMERO CANDIDATO UNINOMINALE","COGNOME E NOME","TOTALE VOTI VALIDI CANDIDATO UNINOMINALE","DI CUI VOTI ESPRESSI AL SOLO CANDIDATO UNINOMINALE","N. LISTE","LISTA COLLEGATA","VOTI ESPRESSI PER LE LISTE"]
[null,1,"DURANTE Luca",{"$f":"SUM(E5,H5)","v":1},null,1,"10 VOLTE MEGLIO",1]
[]
[null,2,"SIMMINI Maria detta Mariagrazia",{"$f":"SUM(E7,H7)","v":2},null,1,"POTERE AL POPOLO",2]
[]
[null,3,"DE LUCA Elena",1,null,1,"PARTITO VALORE UMANO",1]
[]
[null,4,"ALEMANNO Maria Soave",168,null,1,"MOVIMENTO 5 STELLE",168]
[]
[null,5,"DE CARLO Maria Luisa",2,null,1,"IL POPOLO DELLA FAMIGLIA",2]
[null,null,"BLASI Sergio",{"$f":"SUM(D15:D18)","v":69},{"$f":"SUM(E15:E18)","v":4}]
[null,6,"BLASI Sergio",1,null,1,"CIVICA POPOLARE LORENZIN",1]
[null,null,null,2,null,2,"+EUROPA",2]
[null,null,null,66,4,3,"PARTITO DEMOCRATICO",62]
[null,null,null,0,null,4,"ITALIA EUROPA INSIEME",0]
[]
[null,7,"CAMASSA Barbara",2,null,1,"PARTITO COMUNISTA",2]
{"$rows_left_out":23}
{"sheet":"4","index":12,"n_rows":42,"n_cols":9,"rows_kept":42,"cut":false,"hidden":false,"merged":[[33,1,33,2],[1,1,1,7],[14,1,17,1],[14,2,17,2],[29,1,32,1],[29,2,32,2]]}
[]
[null,"SCRUTINIO CAMERA - SEZIONE 4"]
[]
[null,"NUMERO CANDIDATO UNINOMINALE","COGNOME E NOME","TOTALE VOTI VALIDI CANDIDATO UNINOMINALE","DI CUI VOTI ESPRESSI AL SOLO CANDIDATO UNINOMINALE","N. LISTE","LISTA COLLEGATA","VOTI ESPRESSI PER LE LISTE"]
[null,1,"DURANTE Luca",{"$f":"SUM(E5,H5)","v":1},null,1,"10 VOLTE MEGLIO",1]
[]
[null,2,"SIMMINI Maria detta Mariagrazia",{"$f":"SUM(E7,H7)","v":3},1,1,"POTERE AL POPOLO",2]
[]
[null,3,"DE LUCA Elena",3,null,1,"PARTITO VALORE UMANO",3]
[]
[null,4,"ALEMANNO Maria Soave",257,18,1,"MOVIMENTO 5 STELLE",239]
[]
[null,5,"DE CARLO Maria Luisa",9,null,1,"IL POPOLO DELLA FAMIGLIA",9]
[null,null,"BLASI Sergio",{"$f":"SUM(D15:D18)","v":103},{"$f":"SUM(E15:E18)","v":5}]
[null,6,"BLASI Sergio",0,null,1,"CIVICA POPOLARE LORENZIN",0]
[null,null,null,6,null,2,"+EUROPA",6]
[null,null,null,95,5,3,"PARTITO DEMOCRATICO",90]
[null,null,null,2,null,4,"ITALIA EUROPA INSIEME",2]
[]
[null,7,"CAMASSA Barbara",1,null,1,"PARTITO COMUNISTA",1]
{"$rows_left_out":23}
{"sheet":"5","index":13,"n_rows":42,"n_cols":9,"rows_kept":42,"cut":false,"hidden":false,"merged":[[33,1,33,2],[1,1,1,7],[14,1,17,1],[14,2,17,2],[29,1,32,1],[29,2,32,2]]}
[]
[null,"SCRUTINIO CAMERA - SEZIONE 5"]
[]
[null,"NUMERO CANDIDATO UNINOMINALE","COGNOME E NOME","TOTALE VOTI VALIDI CANDIDATO UNINOMINALE","DI CUI VOTI ESPRESSI AL SOLO CANDIDATO UNINOMINALE","N. LISTE","LISTA COLLEGATA","VOTI ESPRESSI PER LE LISTE"]
[null,1,"DURANTE Luca",{"$f":"SUM(E5,H5)","v":0},0,1,"10 VOLTE MEGLIO",0]
[]
[null,2,"SIMMINI Maria detta Mariagrazia",{"$f":"SUM(E7,H7)","v":4},0,1,"POTERE AL POPOLO",4]
[]
[null,3,"DE LUCA Elena",0,0,1,"PARTITO VALORE UMANO",0]
[]
[null,4,"ALEMANNO Maria Soave",182,7,1,"MOVIMENTO 5 STELLE",175]
[]
[null,5,"DE CARLO Maria Luisa",1,null,1,"IL POPOLO DELLA FAMIGLIA",1]
[null,null,"BLASI Sergio",{"$f":"SUM(D15:D18)","v":93},{"$f":"SUM(E15:E18)","v":8}]
[null,6,"BLASI Sergio",1,null,1,"CIVICA POPOLARE LORENZIN",1]
[null,null,null,13,8,2,"+EUROPA",5]
[null,null,null,79,null,3,"PARTITO DEMOCRATICO",79]
[null,null,null,0,null,4,"ITALIA EUROPA INSIEME",0]
[]
[null,7,"CAMASSA Barbara",3,0,1,"PARTITO COMUNISTA",3]
{"$rows_left_out":23}
{"sheet":"6","index":14,"n_rows":42,"n_cols":9,"rows_kept":42,"cut":false,"hidden":false,"merged":[[33,1,33,2],[1,1,1,7],[14,1,17,1],[14,2,17,2],[29,1,32,1],[29,2,32,2]]}
[]
[null,"SCRUTINIO CAMERA - SEZIONE 6"]
[]
[null,"NUMERO CANDIDATO UNINOMINALE","COGNOME E NOME","TOTALE VOTI VALIDI CANDIDATO UNINOMINALE","DI CUI VOTI ESPRESSI AL SOLO CANDIDATO UNINOMINALE","N. LISTE","LISTA COLLEGATA","VOTI ESPRESSI PER LE LISTE"]
[null,1,"DURANTE Luca",{"$f":"SUM(E5,H5)","v":2},null,1,"10 VOLTE MEGLIO",2]
[]
[null,2,"SIMMINI Maria detta Mariagrazia",{"$f":"SUM(E7,H7)","v":5},null,1,"POTERE AL POPOLO",5]
[]
[null,3,"DE LUCA Elena",0,null,1,"PARTITO VALORE UMANO",0]
[]
[null,4,"ALEMANNO Maria Soave",207,20,1,"MOVIMENTO 5 STELLE",187]
[]
[null,5,"DE CARLO Maria Luisa",9,null,1,"IL POPOLO DELLA FAMIGLIA",9]
[null,null,"BLASI Sergio",{"$f":"SUM(D15:D18)","v":76},{"$f":"SUM(E15:E18)","v":1}]
[null,6,"BLASI Sergio",0,null,1,"CIVICA POPOLARE LORENZIN",0]
[null,null,null,6,null,2,"+EUROPA",6]
[null,null,null,68,1,3,"PARTITO DEMOCRATICO",67]
[null,null,null,2,null,4,"ITALIA EUROPA INSIEME",2]
[]
[null,7,"CAMASSA Barbara",0,null,1,"PARTITO COMUNISTA",0]
{"$rows_left_out":23}
{"sheet":"Candidati","index":15,"n_rows":15,"n_cols":4,"rows_kept":15,"cut":false,"hidden":false,"merged":[[2,1,2,2]]}
[]
[]
[null,"CANDIDATO",null,"VOTI"]
[null,1,{"$f":"Scrutinio!O7","v":"DURANTE"},{"$f":"Scrutinio!O17","v":6}]
[null,2,{"$f":"Scrutinio!P7","v":"SIMMINI"},{"$f":"Scrutinio!P17","v":21}]
[null,3,{"$f":"Scrutinio!Q7","v":"DE LUCA"},{"$f":"Scrutinio!Q17","v":5}]
[null,4,{"$f":"Scrutinio!R7","v":"ALEMANNO"},{"$f":"Scrutinio!R17","v":1167}]
[null,5,{"$f":"Scrutinio!S7","v":"DE CARLO"},{"$f":"Scrutinio!S17","v":30}]
[null,6,{"$f":"Scrutinio!T7","v":"BLASI"},{"$f":"Scrutinio!T17","v":528}]
[null,7,{"$f":"Scrutinio!U7","v":"CAMASSA"},{"$f":"Scrutinio!U17","v":9}]
[null,8,{"$f":"Scrutinio!V7","v":"RISI"},{"$f":"Scrutinio!V17","v":93}]
[null,9,{"$f":"Scrutinio!W7","v":"CITTA"},{"$f":"Scrutinio!W17","v":1}]
[null,10,{"$f":"Scrutinio!X7","v":"BALDASSARRE"},{"$f":"Scrutinio!X17","v":21}]
[null,11,{"$f":"Scrutinio!Y7","v":"GIURI"},{"$f":"Scrutinio!Y17","v":13}]
[null,12,{"$f":"Scrutinio!Z7","v":"CAROPPO"},{"$f":"Scrutinio!Z17","v":1608}]